Target
Alpha-1A adrenergic receptor
Ligand
BDBM86202
Substrate
Ki
>10000±n/a nM
Comments
PDSP_2971
Citation
 Shi, QSavage, JEHufeisen, SJRauser, LGrajkowska, EErnsberger, PWroblewski, JTNadeau, JHRoth, BL L-homocysteine sulfinic acid and other acidic homocysteine derivatives are potent and selective metabotropic glutamate receptor agonists. J Pharmacol Exp Ther 305:131-42 (2003)  
Target
Name:
Alpha-1A adrenergic receptor
Synonyms:
ADA1A_HUMAN ADRA1C Alpha 1A-adrenoceptor Alpha adrenergic receptor 1a Alpha-adrenergic receptor 1c adrenergic Alpha1 | adrenergic Alpha1C
Type:
Cell-surface receptors
Mol. Mass.:
51511.67
Organism:
Homo sapiens (Human)
Description:
P35348
Residue:
466
  
Inhibitor
Name:
BDBM86202
Synonyms:
CAS_778 NSC_778
Type:
Small organic molecule
Emp. Form.:
C4H9NO2S
Mol. Mass.:
135.185
SMILES:
NC(CCS)C(O)=O
: