Target
Sodium-dependent noradrenaline transporter
Ligand
BDBM86202
Substrate
Ki
>10000±n/a nM
Comments
PDSP_2971
Citation
 Shi, QSavage, JEHufeisen, SJRauser, LGrajkowska, EErnsberger, PWroblewski, JTNadeau, JHRoth, BL L-homocysteine sulfinic acid and other acidic homocysteine derivatives are potent and selective metabotropic glutamate receptor agonists. J Pharmacol Exp Ther 305:131-42 (2003)  
Target
Name:
Sodium-dependent noradrenaline transporter
Synonyms:
Monoamine transporter NET Noradrenaline Transporter (NET) Norepinephrine transporter protein (NET) SLC6A2 Sodium-dependent noradrenaline transporter (NET) | Solute carrier family 6 member 2
Type:
Multi-pass membrane protein
Mol. Mass.:
69337.72
Organism:
Homo sapiens (Human)
Description:
P23975
Residue:
617
  
Inhibitor
Name:
BDBM86202
Synonyms:
CAS_778 NSC_778
Type:
Small organic molecule
Emp. Form.:
C4H9NO2S
Mol. Mass.:
135.185
SMILES:
NC(CCS)C(O)=O
: