Target
Oxytocin receptor
Ligand
BDBM86202
Substrate
Ki
>10000±n/a nM
Comments
PDSP_2971
Citation
 Shi, QSavage, JEHufeisen, SJRauser, LGrajkowska, EErnsberger, PWroblewski, JTNadeau, JHRoth, BL L-homocysteine sulfinic acid and other acidic homocysteine derivatives are potent and selective metabotropic glutamate receptor agonists. J Pharmacol Exp Ther 305:131-42 (2003)  
Target
Name:
Oxytocin receptor
Synonyms:
OT-R OXYR_HUMAN | Oxytocin
Type:
Enzyme Catalytic Domain
Mol. Mass.:
42793.26
Organism:
Homo sapiens (Human)
Description:
Oxytocin OXTR HEK293::B2R9L7
Residue:
389
  
Inhibitor
Name:
BDBM86202
Synonyms:
CAS_778 NSC_778
Type:
Small organic molecule
Emp. Form.:
C4H9NO2S
Mol. Mass.:
135.185
SMILES:
NC(CCS)C(O)=O
: