Target
Epidermal growth factor receptor
Ligand
BDBM3569
Substrate
EGF-R Substrate
Meas. Tech.
Kinase Inhibition Assay
IC50
113±n/a nM
Citation
 Bridges, AJZhou, HRCody, DRRewcastle, GWMcMichael, AShowalter, HHFry, DWKraker, AJDenny, WA Tyrosine Kinase Inhibitors. 8. An Unusually Steep Structure-Activity Relationship for Analogues of 4-(3-Bromoanilino)-6,7-dimethoxyquinazoline (PD 153035), a Potent Inhibitor of the Epidermal Growth Factor Receptor J Med Chem 39:267-76 (1996)  
Target
Name:
Epidermal growth factor receptor
Synonyms:
EGF Receptor Substrate EGFR_HUMAN ERBB1 Epidermal Growth Factor Receptor erbB-1 Epidermal growth factor receptor (EGFR) HER1 Proto-oncogene c-ErbB-1 Tyrosine-Protein Kinase ErbB-1
Type:
Receptor Kinase Domain
Mol. Mass.:
134279.59
Organism:
Homo sapiens (Human)
Description:
P00533
Residue:
1210
  
Inhibitor
Name:
BDBM3569
Synonyms:
CHEMBL92709 PD153035 Analog 69
Type:
Small organic molecule
Emp. Form.:
C16H13Br2N3O2
Mol. Mass.:
439.101
SMILES:
COc1cc2ncnc(Nc3cc(Br)cc(Br)c3)c2cc1OC
:
Substrate
Name:
EGF-R Substrate
Synonyms:
Type:
Peptide
Mol. Mass.:
4119.23
Organism:
Description:
The sequence is based on a portion of phospholipase C-gamma. 10 uM ATP containing 1 uCi of [gamma-32P]ATP as co-substrate.
Residue:
38