Target
Neuronal acetylcholine receptor subunit alpha-3
Ligand
BDBM50004108
Substrate
Ki
14±n/a nM
Comments
PDSP_1311
Citation
 Cohen, CBergis, OEGalli, FLochead, AWJegham, SBiton, BLeonardon, JAvenet, PSgard, FBesnard, FGraham, DCoste, AOblin, ACuret, OVoltz, CGardes, ACaille, DPerrault, GGeorge, PSoubrie, PScatton, B SSR591813, a novel selective and partial alpha4beta2 nicotinic receptor agonist with potential as an aid to smoking cessation. J Pharmacol Exp Ther 306:407-20 (2003)  
Target
Name:
Neuronal acetylcholine receptor subunit alpha-3
Synonyms:
ACHA3_HUMAN Cholinergic, Nicotinic Alpha3Beta2 Cholinergic, Nicotinic Alpha3Beta4x NACHRA3 Neuronal acetylcholine receptor subunit alpha-3 nicotinic central
Type:
Enzyme Catalytic Domain
Mol. Mass.:
57479.03
Organism:
Homo sapiens (Human)
Description:
Cholinergic, Nicotinic Alpha3Beta2 0 HUMAN::P32297
Residue:
505
  
Inhibitor
Name:
BDBM50004108
Synonyms:
(+-)-nicotine (RS)-nicotine CHEMBL440464 Nicotine-(+) US11667638, Example Nicotine US9284322, Nicotine nicotine
Type:
Small organic molecule
Emp. Form.:
C10H14N2
Mol. Mass.:
162.2316
SMILES:
CN1CCCC1c1cccnc1
: