Target
Metabotropic glutamate receptor 1
Ligand
BDBM50231744
Substrate
Ki
1.36±n/a nM
Comments
PDSP_3098
Citation
 Lavreysen, HJanssen, CBischoff, FLanglois, XLeysen, JELesage, AS [3H]R214127: a novel high-affinity radioligand for the mGlu1 receptor reveals a common binding site shared by multiple allosteric antagonists. Mol Pharmacol 63:1082-93 (2003)  
Target
Name:
Metabotropic glutamate receptor 1
Synonyms:
GRM1_RAT Grm1 Metabotropic glutamate receptor Mglur1 metabotropic glutamate 1/5-D metabotropic glutamate receptor 1 isoform alpha precursor
Type:
Enzyme Catalytic Domain
Mol. Mass.:
133240.47
Organism:
RAT
Description:
metabotropic glutamate 1/2 0 RAT::P23385
Residue:
1199
  
Inhibitor
Name:
BDBM50231744
Synonyms:
CHEMBL399160 quinoxaline-2-carboxylic acid adamantan-1-ylamide
Type:
Small organic molecule
Emp. Form.:
C19H21N3O
Mol. Mass.:
307.3895
SMILES:
O=C(NC12CC3CC(CC(C3)C1)C2)c1cnc2ccccc2n1
: