Target
Sodium-dependent serotonin transporter
Ligand
BDBM86234
Substrate
Ki
74±n/a nM
Comments
PDSP_1186
Citation
 Setola, VHufeisen, SJGrande-Allen, KJVesely, IGlennon, RABlough, BRothman, RBRoth, BL 3,4-methylenedioxymethamphetamine (MDMA, "Ecstasy") induces fenfluramine-like proliferative actions on human cardiac valvular interstitial cells in vitro. Mol Pharmacol 63:1223-9 (2003)  
Target
Name:
Sodium-dependent serotonin transporter
Synonyms:
5-HT Transporter 5HT transporter Anandamid membrane transporter, AMT Monoamine transporters; Norepinephrine & serotonin Slc6a4 Sodium-dependent serotonin transporter (SERT) | imipramine receptor
Type:
Multi-pass membrane protein
Mol. Mass.:
70168.43
Organism:
Rattus norvegicus (rat)
Description:
P31652
Residue:
630
  
Inhibitor
Name:
BDBM86234
Synonyms:
CAS_64057-70-1 NSC_126235
Type:
Small organic molecule
Emp. Form.:
C11H15NO2
Mol. Mass.:
193.2423
SMILES:
CN[C@H](C)Cc1ccc2OCOc2c1
: