Target
5-hydroxytryptamine receptor 2B
Ligand
BDBM84738
Substrate
Ki
400±n/a nM
Comments
PDSP_813
Citation
 Setola, VHufeisen, SJGrande-Allen, KJVesely, IGlennon, RABlough, BRothman, RBRoth, BL 3,4-methylenedioxymethamphetamine (MDMA, "Ecstasy") induces fenfluramine-like proliferative actions on human cardiac valvular interstitial cells in vitro. Mol Pharmacol 63:1223-9 (2003)  
Target
Name:
5-hydroxytryptamine receptor 2B
Synonyms:
5-HT-2B 5-hydroxytryptamine (serotonin) receptor 2B [Homo sapiens] 5-hydroxytryptamine receptor 2C (5HT2C) HTR2B Serotonin 2b (5-HT2b) receptor | Serotonin Receptor 2B
Type:
G Protein-Coupled Receptor (GPCR)
Mol. Mass.:
54312.47
Organism:
Homo sapiens (Human)
Description:
Receptor binding assays were performed using human clone stably expressed in CHO cells.
Residue:
481
  
Inhibitor
Name:
BDBM84738
Synonyms:
CAS_16105-77-4 Fenfluramine (+) NSC_3337 | d-Fenfluramine
Type:
Small organic molecule
Emp. Form.:
C12H16F3N
Mol. Mass.:
231.2573
SMILES:
CCNC(C)Cc1cccc(c1)C(F)(F)F
: