Target
Norepinephrine transporter
Ligand
BDBM86234
Substrate
Ki
136±n/a nM
Comments
PDSP_1186
Citation
 Setola, VHufeisen, SJGrande-Allen, KJVesely, IGlennon, RABlough, BRothman, RBRoth, BL 3,4-methylenedioxymethamphetamine (MDMA, "Ecstasy") induces fenfluramine-like proliferative actions on human cardiac valvular interstitial cells in vitro. Mol Pharmacol 63:1223-9 (2003)  
Target
Name:
Norepinephrine transporter
Synonyms:
Type:
Enzyme Catalytic Domain
Mol. Mass.:
2082.45
Organism:
RAT
Description:
Norepinephrine transporter 0 RAT::Q9JIA2
Residue:
19
MLLARMKPQVQPELGGADQ
  
Inhibitor
Name:
BDBM86234
Synonyms:
CAS_64057-70-1 NSC_126235
Type:
Small organic molecule
Emp. Form.:
C11H15NO2
Mol. Mass.:
193.2423
SMILES:
CN[C@H](C)Cc1ccc2OCOc2c1
: