Target
Cholinergic receptor nicotinic alpha 6 subunit
Ligand
BDBM86241
Substrate
Ki
502±n/a nM
Comments
PDSP_666
Citation
 Vailati, SMoretti, MLonghi, RRovati, GEClementi, FGotti, C Developmental expression of heteromeric nicotinic receptor subtypes in chick retina. Mol Pharmacol 63:1329-37 (2003)  
Target
Name:
Cholinergic receptor nicotinic alpha 6 subunit
Synonyms:
Cholinergic, Nicotinic Alpha6Beta2
Type:
Enzyme Catalytic Domain
Mol. Mass.:
57281.61
Organism:
Chick
Description:
Cholinergic, Nicotinic Alpha6Beta2 0 Chick::F7CGJ7
Residue:
492
  
Inhibitor
Name:
BDBM86241
Synonyms:
CAS_23255-54-1 NSC_31762
Type:
Small organic molecule
Emp. Form.:
C16H21NO3
Mol. Mass.:
275.3428
SMILES:
COC1CC=C2CCN3CCC4=C(CC(=O)OC4)C23C1
: