Target
Uncharacterized protein
Ligand
BDBM10759
Substrate
Ki
72±n/a nM
Comments
PDSP_229
Citation
 Vailati, SMoretti, MLonghi, RRovati, GEClementi, FGotti, C Developmental expression of heteromeric nicotinic receptor subtypes in chick retina. Mol Pharmacol 63:1329-37 (2003)  
Target
Name:
Uncharacterized protein
Synonyms:
Cholinergic, Nicotinic Alpha6Beta4
Type:
Enzyme Catalytic Domain
Mol. Mass.:
55323.77
Organism:
Chick
Description:
Cholinergic, Nicotinic Alpha6Beta4 0 Chick::F6Z813
Residue:
486
  
Inhibitor
Name:
BDBM10759
Synonyms:
2-acetoxyethyl(trimethyl)ammonium;bromide CHEMBL667 [2-(acetyloxy)ethyl]trimethylazanium acetylcholine chloride | cid_6060
Type:
Small Organic Molecule
Emp. Form.:
C7H16NO2
Mol. Mass.:
146.2069
SMILES:
CC(=O)OCC[N+](C)(C)C
: