Target
Mu-type opioid receptor
Ligand
BDBM86253
Substrate
Ki
1.72±n/a nM
Comments
PDSP_616
Citation
 Spetea, MTóth, FSchütz, JOtvös, FTóth, GBenyhe, SBorsodi, ASchmidhammer, H Binding characteristics of [3H]14-methoxymetopon, a high affinity mu-opioid receptor agonist. Eur J Neurosci 18:290-5 (2003)  
Target
Name:
Mu-type opioid receptor
Synonyms:
MOR-1 Mu-type opioid receptor (MOR) OPRM_RAT Opioid receptor B Ror-b
Type:
G Protein-Coupled Receptor (GPCR)
Mol. Mass.:
44503.11
Organism:
Rattus norvegicus (rat)
Description:
Competition binding assays were carried out using membrane preparations from transfected HN9.10 cells that constitutively expressed the mu opioid receptor.
Residue:
398
  
Inhibitor
Name:
BDBM86253
Synonyms:
CAS_100929-53-1 NSC_104742 | US10836728, Compound DAMGO
Type:
Small organic molecule
Emp. Form.:
C26H35N5O6
Mol. Mass.:
513.586
SMILES:
CC(NC(=O)C(N)Cc1ccc(O)cc1)C(=O)NCC(=O)N(C)C(Cc1ccccc1)C(=O)NCCO
: