Target
5-hydroxytryptamine receptor 2A
Ligand
BDBM86276
Substrate
Ki
70.6±n/a nM
Comments
PDSP_4921
Citation
 Neumeyer, JLKula, NSBergman, JBaldessarini, RJ Receptor affinities of dopamine D1 receptor-selective novel phenylbenzazepines. Eur J Pharmacol 474:137-40 (2003)  
Target
Name:
5-hydroxytryptamine receptor 2A
Synonyms:
5-HT-2A 5-HT2A 5-hydroxytryptamine receptor 2A (5HT2A) Htr2 Serotonin Receptor 2A
Type:
G Protein-Coupled Receptor (GPCR)
Mol. Mass.:
52852.05
Organism:
Rattus norvegicus (rat)
Description:
Rat cortex membranes 5-HT2A receptors.
Residue:
471
  
Inhibitor
Name:
BDBM86276
Synonyms:
CAS_0 NSC_0
Type:
Small organic molecule
Emp. Form.:
C18H20ClNO2
Mol. Mass.:
317.81
SMILES:
CN1CCc2c(Cl)c(O)c(O)cc2C(C1)c1ccccc1C
: