Target
Alpha-2C adrenergic receptor
Ligand
BDBM50004918
Substrate
Ki
632±n/a nM
Comments
PDSP_1722
Citation
 Neumeyer, JLKula, NSBergman, JBaldessarini, RJ Receptor affinities of dopamine D1 receptor-selective novel phenylbenzazepines. Eur J Pharmacol 474:137-40 (2003)  
Target
Name:
Alpha-2C adrenergic receptor
Synonyms:
ADA2C_RAT Adrenergic receptor alpha adrenergic Alpha2 | adrenergic Alpha2C
Type:
Enzyme Catalytic Domain
Mol. Mass.:
49890.50
Organism:
RAT
Description:
adrenergic Alpha2 0 RAT::P22086
Residue:
458
  
Inhibitor
Name:
BDBM50004918
Synonyms:
(+/-)-APD3-Allyl-1-phenyl-2,3,4,5-tetrahydro-1H-benzo[d]azepine-7,8-diol CHEMBL288090 SKF 77434
Type:
Small organic molecule
Emp. Form.:
C19H21NO2
Mol. Mass.:
295.3755
SMILES:
Oc1cc2CCN(CC=C)CC(c3ccccc3)c2cc1O
: