Target
D(2) dopamine receptor
Ligand
BDBM86265
Substrate
Ki
239±n/a nM
Comments
PDSP_4934
Citation
 Neumeyer, JLKula, NSBergman, JBaldessarini, RJ Receptor affinities of dopamine D1 receptor-selective novel phenylbenzazepines. Eur J Pharmacol 474:137-40 (2003)  
Target
Name:
D(2) dopamine receptor
Synonyms:
DOPAMINE D2 DOPAMINE D2 Short Dopamine D2 receptor Drd2
Type:
G Protein-Coupled Receptor (GPCR)
Mol. Mass.:
50931.60
Organism:
Rattus norvegicus (rat)
Description:
P61169
Residue:
444
  
Inhibitor
Name:
BDBM86265
Synonyms:
MCL-215
Type:
Small organic molecule
Emp. Form.:
C20H22BrNO2
Mol. Mass.:
388.298
SMILES:
Cc1ccccc1C1CN(CC=C)CCc2c(Br)c(O)c(O)cc12
: