Target
Non-receptor tyrosine-protein kinase TYK2
Ligand
BDBM277537
Substrate
Meas. Tech.
Biochemical JAK Assay
pH
7.5±n/a
Ki
0.55±n/a nM
Comments
extracted
Citation
 Huang, XThalladi, VR Crystalline form of 3-((1R,3s,5S)-3-((7-((5-methyl-1H-pyrazol-3-yl)amino)-1,6-naphthyridin-5-yl)amino)-8-azabicyclo[3.2.1]octan-8-yl)propanenitrile US Patent  US10072026 Publication Date 9/11/2018 
Target
Name:
Non-receptor tyrosine-protein kinase TYK2
Synonyms:
Non-receptor tyrosine-protein kinase TYK2 (TYK2) TYK2_HUMAN | Tyrosine-protein kinase TYK2
Type:
Protein
Mol. Mass.:
133666.03
Organism:
Homo sapiens (Human)
Description:
P29597
Residue:
1187
  
Inhibitor
Name:
BDBM277537
Synonyms:
US10072026, Example 4-28
Type:
Small organic molecule
Emp. Form.:
C27H38N8O2S
Mol. Mass.:
538.708
SMILES:
CCCC1CCCN1S(=O)(=O)N1[C@H]2CCC[C@@H]1C[C@H](C2)Nc1nc(Nc2cc(C)[nH]n2)cc2ncccc12
: