Target
Tyrosine-protein kinase JAK3
Ligand
BDBM277563
Substrate
Meas. Tech.
Biochemical JAK Assay
pH
7.5±n/a
Ki
0.55±n/a nM
Comments
extracted
Citation
 Huang, XThalladi, VR Crystalline form of 3-((1R,3s,5S)-3-((7-((5-methyl-1H-pyrazol-3-yl)amino)-1,6-naphthyridin-5-yl)amino)-8-azabicyclo[3.2.1]octan-8-yl)propanenitrile US Patent  US10072026 Publication Date 9/11/2018 
Target
Name:
Tyrosine-protein kinase JAK3
Synonyms:
JAK-3 JAK3_HUMAN Janus kinase 3 (JAK3) L-JAK | Leukocyte janus kinase
Type:
Protein
Mol. Mass.:
125111.08
Organism:
Homo sapiens (Human)
Description:
P52333
Residue:
1124
  
Inhibitor
Name:
BDBM277563
Synonyms:
US10072026, Example 5-25 | US11780852, Example 5-25
Type:
Small organic molecule
Emp. Form.:
C29H38N8O3
Mol. Mass.:
546.6638
SMILES:
Cc1cc(Nc2cc3nc(CN4CCOCC4)ccc3c(N[C@H]3C[C@@H]4CCC[C@H](C3)N4C(=O)OCC=C)n2)n[nH]1
: