Target
Neuronal acetylcholine receptor subunit alpha-2
Ligand
BDBM85224
Substrate
Ki
24±n/a nM
Comments
PDSP_1165
Citation
 Jensen, AAMikkelsen, IFrølund, BBräuner-Osborne, HFalch, EKrogsgaard-Larsen, P Carbamoylcholine homologs: novel and potent agonists at neuronal nicotinic acetylcholine receptors. Mol Pharmacol 64:865-75 (2003)  
Target
Name:
Neuronal acetylcholine receptor subunit alpha-2
Synonyms:
ACHA2_RAT Cholinergic, Nicotinic Alpha2Beta2 Chrna2
Type:
Enzyme
Mol. Mass.:
58597.25
Organism:
Rattus norvegicus (Rat)
Description:
P12389
Residue:
511
  
Inhibitor
Name:
BDBM85224
Synonyms:
CAS_1918-18-9 SWEP
Type:
Small organic molecule
Emp. Form.:
C8H7Cl2NO2
Mol. Mass.:
220.053
SMILES:
COC(=O)Nc1ccc(Cl)c(Cl)c1
: