Target
Neuronal acetylcholine receptor subunit alpha-2
Ligand
BDBM50275262
Substrate
Ki
100±n/a nM
Comments
PDSP_3403
Citation
 Jensen, AAMikkelsen, IFrølund, BBräuner-Osborne, HFalch, EKrogsgaard-Larsen, P Carbamoylcholine homologs: novel and potent agonists at neuronal nicotinic acetylcholine receptors. Mol Pharmacol 64:865-75 (2003)  
Target
Name:
Neuronal acetylcholine receptor subunit alpha-2
Synonyms:
ACHA2_RAT Cholinergic, Nicotinic Alpha2Beta2 Chrna2
Type:
Enzyme
Mol. Mass.:
58597.25
Organism:
Rattus norvegicus (Rat)
Description:
P12389
Residue:
511
  
Inhibitor
Name:
BDBM50275262
Synonyms:
3-(dimethylamino)butyl dimethylcarbamate CHEMBL486572
Type:
Small organic molecule
Emp. Form.:
C9H20N2O2
Mol. Mass.:
188.2673
SMILES:
CC(CCOC(=O)N(C)C)N(C)C
: