Target
Neuronal acetylcholine receptor subunit alpha-7
Ligand
BDBM50047021
Substrate
Ki
>10000±n/a nM
Comments
PDSP_1085
Citation
 Jensen, AAMikkelsen, IFrølund, BBräuner-Osborne, HFalch, EKrogsgaard-Larsen, P Carbamoylcholine homologs: novel and potent agonists at neuronal nicotinic acetylcholine receptors. Mol Pharmacol 64:865-75 (2003)  
Target
Name:
Neuronal acetylcholine receptor subunit alpha-7
Synonyms:
ACHA7_RAT Cholinergic, Nicotinic Alpha7 Chrna7 Neuronal acetylcholine receptor (alpha7 nAChR) Neuronal acetylcholine receptor subunit alpha-7 Neuronal acetylcholine receptor subunit alpha-7 (nAChR)
Type:
Enzyme
Mol. Mass.:
56502.44
Organism:
Rattus norvegicus (Rat)
Description:
Q05941
Residue:
502
  
Inhibitor
Name:
BDBM50047021
Synonyms:
2-(6-(2-hydroxy-2-phenylethyl)-1-methylpiperidin-2-yl)-1-phenylethanone 2-[6-(2-Hydroxy-2-phenyl-ethyl)-1-methyl-piperidin-2-yl]-1-phenyl-ethanone (lobeline) Lobeline Lobeline,Alpha
Type:
Small organic molecule
Emp. Form.:
C22H27NO2
Mol. Mass.:
337.4553
SMILES:
CN1C(CC(O)c2ccccc2)CCCC1CC(=O)c1ccccc1
: