Target
Neuronal acetylcholine receptor subunit alpha-7
Ligand
BDBM86309
Substrate
Ki
3.9±n/a nM
Comments
PDSP_1228
Citation
 Jensen, AAMikkelsen, IFrølund, BBräuner-Osborne, HFalch, EKrogsgaard-Larsen, P Carbamoylcholine homologs: novel and potent agonists at neuronal nicotinic acetylcholine receptors. Mol Pharmacol 64:865-75 (2003)  
Target
Name:
Neuronal acetylcholine receptor subunit alpha-7
Synonyms:
ACHA7_RAT Cholinergic, Nicotinic Alpha7 Chrna7 Neuronal acetylcholine receptor (alpha7 nAChR) Neuronal acetylcholine receptor subunit alpha-7 Neuronal acetylcholine receptor subunit alpha-7 (nAChR)
Type:
Enzyme
Mol. Mass.:
56502.44
Organism:
Rattus norvegicus (Rat)
Description:
Q05941
Residue:
502
  
Inhibitor
Name:
BDBM86309
Synonyms:
CAS_21019-30-7 NSC_5311278
Type:
Small organic molecule
Emp. Form.:
C37H50N2O10
Mol. Mass.:
682.8003
SMILES:
CCN1CC2(COC(=O)c3ccccc3-n3c(O)cc(C)c3O)CCC(OC)C34C5CC6C(OC)C5C(O)(CC6OC)C(O)(C(OC)C23)C14
: