Target
5-hydroxytryptamine receptor 6
Ligand
BDBM50020712
Substrate
Ki
89.13±n/a nM
Comments
PDSP_288
Citation
 Hirst, WDAbrahamsen, BBlaney, FECalver, ARAloj, LPrice, GWMedhurst, AD Differences in the central nervous system distribution and pharmacology of the mouse 5-hydroxytryptamine-6 receptor compared with rat and human receptors investigated by radioligand binding, site-directed mutagenesis, and molecular modeling. Mol Pharmacol 64:1295-308 (2003)  
Target
Name:
5-hydroxytryptamine receptor 6
Synonyms:
5-HT6 5HT6R_MOUSE | Htr6
Type:
Enzyme Catalytic Domain
Mol. Mass.:
47012.98
Organism:
MOUSE
Description:
5-HT6 HTR6 MOUSE::Q9R1C8
Residue:
440
  
Inhibitor
Name:
BDBM50020712
Synonyms:
10,11-dihydro-5-(gamma-dimethylaminopropylidene)-5H-dibenzo(a,d)cycloheptene 3-(10,11-dihydro-5H-dibenzo(a,d)cyclohepten-5-ylidene)-N,N-dimethyl-1-propanamine 3-(10,11-dihydro-5H-dibenzo[a,d]cyclohepten-5-ylidene)-N,N-dimethylpropan-1-amine 5-(3-dimethylaminopropylidene)-10,11-dihydro-5H-dibenzo(a,d)cycloheptene AMITRIPTYLINE CHEMBL629
Type:
Small organic molecule
Emp. Form.:
C20H23N
Mol. Mass.:
277.4033
SMILES:
[#6]-[#7](-[#6])-[#6]-[#6]\[#6]=[#6]-1/c2ccccc2-[#6]-[#6]-c2ccccc-12
: