Target
Protein kinase C delta type
Ligand
BDBM86434
Substrate
Ki
0.56±n/a nM
Comments
PDSP_3222
Citation
 Wang, QJFang, TWYang, DLewin, NEVan Lint, JMarquez, VEBlumberg, PM Ligand structure-activity requirements and phospholipid dependence for the binding of phorbol esters to protein kinase D. Mol Pharmacol 64:1342-8 (2003)  
Target
Name:
Protein kinase C delta type
Synonyms:
KPCD_HUMAN PKCD Protein Kinase C- delta nPKC-delta
Type:
Enzyme
Mol. Mass.:
77516.79
Organism:
Homo sapiens (Human)
Description:
The recombinant human PKC enzymes were produced using a baculovirus expression system in SF9 cells
Residue:
676
  
Inhibitor
Name:
BDBM86434
Synonyms:
12-Deoxyphorbol 13-phenylacetate NSC_105100
Type:
Small organic molecule
Emp. Form.:
C28H34O6
Mol. Mass.:
466.566
SMILES:
CC1CC2(OC(=O)Cc3ccccc3)C(C3C=C(CO)CC4(O)C(C=C(C)C4=O)C13O)C2(C)C
: