Target
Polycystin-1
Ligand
BDBM86431
Substrate
Ki
0.43±n/a nM
Comments
PDSP_3226
Citation
 Wang, QJFang, TWYang, DLewin, NEVan Lint, JMarquez, VEBlumberg, PM Ligand structure-activity requirements and phospholipid dependence for the binding of phorbol esters to protein kinase D. Mol Pharmacol 64:1342-8 (2003)  
Target
Name:
Polycystin-1
Synonyms:
PKD1 Protein Kinase D-GST
Type:
Enzyme Catalytic Domain
Mol. Mass.:
462537.85
Organism:
Homo sapiens (Human)
Description:
Protein Kinase D-GST 0 HUMAN::P98161
Residue:
4303
  
Inhibitor
Name:
BDBM86431
Synonyms:
CAS_4179 NSC_4179
Type:
Small organic molecule
Emp. Form.:
C38H38O10
Mol. Mass.:
654.7023
SMILES:
CC1C(OC(=O)C=CC=Cc2ccccc2)C2(OC3(OC2C2C4OC4(CO)C(O)C4(O)C(C=C(C)C4=O)C12O3)c1ccccc1)C(C)=C
: