Target
Beta-1 adrenergic receptor
Ligand
BDBM50131281
Substrate
Ki
>10000±n/a nM
Comments
PDSP_817
Citation
 Hoffmann, CLeitz, MROberdorf-Maass, SLohse, MJKlotz, KN Comparative pharmacology of human beta-adrenergic receptor subtypes--characterization of stably transfected receptors in CHO cells. Naunyn Schmiedebergs Arch Pharmacol 369:151-9 (2004)  
Target
Name:
Beta-1 adrenergic receptor
Synonyms:
ADRB1 ADRB1_HUMAN Beta-1 adrenoceptor | adrenergic Beta1
Type:
G Protein-Coupled Receptor (GPCR)
Mol. Mass.:
51338.40
Organism:
Homo sapiens (Human)
Description:
P08588
Residue:
477
  
Inhibitor
Name:
BDBM50131281
Synonyms:
5-(1-hydroxy-2-(1-(4-hydroxyphenyl)propan-2-ylamino)ethyl)benzene-1,3-diol CHEMBL32800 | FENOTEROL
Type:
Small organic molecule
Emp. Form.:
C17H21NO4
Mol. Mass.:
303.3529
SMILES:
CC(Cc1ccc(O)cc1)NCC(O)c1cc(O)cc(O)c1
: