Target
Beta-2 adrenergic receptor
Ligand
BDBM50131281
Substrate
Ki
719±n/a nM
Comments
PDSP_817
Citation
 Hoffmann, CLeitz, MROberdorf-Maass, SLohse, MJKlotz, KN Comparative pharmacology of human beta-adrenergic receptor subtypes--characterization of stably transfected receptors in CHO cells. Naunyn Schmiedebergs Arch Pharmacol 369:151-9 (2004)  
Target
Name:
Beta-2 adrenergic receptor
Synonyms:
ADRB2 ADRB2_HUMAN Beta-2 adrenoceptor | Beta-2 adrenoreceptor
Type:
Mol. Mass.:
46461.69
Organism:
Homo sapiens (Human)
Description:
P07550
Residue:
413
  
Inhibitor
Name:
BDBM50131281
Synonyms:
5-(1-hydroxy-2-(1-(4-hydroxyphenyl)propan-2-ylamino)ethyl)benzene-1,3-diol CHEMBL32800 | FENOTEROL
Type:
Small organic molecule
Emp. Form.:
C17H21NO4
Mol. Mass.:
303.3529
SMILES:
CC(Cc1ccc(O)cc1)NCC(O)c1cc(O)cc(O)c1
: