Target
Beta-2 adrenergic receptor
Ligand
BDBM25771
Substrate
Ki
24.6±n/a nM
Comments
PDSP_4082
Citation
 Hoffmann, CLeitz, MROberdorf-Maass, SLohse, MJKlotz, KN Comparative pharmacology of human beta-adrenergic receptor subtypes--characterization of stably transfected receptors in CHO cells. Naunyn Schmiedebergs Arch Pharmacol 369:151-9 (2004)  
Target
Name:
Beta-2 adrenergic receptor
Synonyms:
ADRB2 ADRB2_HUMAN Beta-2 adrenoceptor | Beta-2 adrenoreceptor
Type:
Mol. Mass.:
46461.69
Organism:
Homo sapiens (Human)
Description:
P07550
Residue:
413
  
Inhibitor
Name:
BDBM25771
Synonyms:
1-hydroxy-2-naphthoic acid;4-[1-hydroxy-2-[6-(4-phenylbutoxy)hexylamino]ethyl]-2-methylol-phenol Aeromax Serevent | salmeterol xinafoate
Type:
Small organic molecule
Emp. Form.:
C25H37NO4
Mol. Mass.:
415.5656
SMILES:
OCc1cc(ccc1O)C(O)CNCCCCCCOCCCCc1ccccc1
: