Target
Alpha-1B adrenergic receptor
Ligand
BDBM86475
Substrate
Ki
>10000±n/a nM
Comments
PDSP_3777
Citation
 Millan, MJCussac, DGobert, ALejeune, FRivet, JMMannoury La Cour, CNewman-Tancredi, APeglion, JL S32504, a novel naphtoxazine agonist at dopamine D3/D2 receptors: I. Cellular, electrophysiological, and neurochemical profile in comparison with ropinirole. J Pharmacol Exp Ther 309:903-20 (2004)  
Target
Name:
Alpha-1B adrenergic receptor
Synonyms:
ADA1B_HUMAN Adrenergic alpha1B Adrenergic receptor alpha Alpha 1B-adrenoreceptor | Alpha-1B adrenergic receptor
Type:
Enzyme
Mol. Mass.:
56862.13
Organism:
Homo sapiens (Human)
Description:
P35368
Residue:
520
  
Inhibitor
Name:
BDBM86475
Synonyms:
S32504
Type:
Small organic molecule
Emp. Form.:
C16H22N2O2
Mol. Mass.:
274.3581
SMILES:
CCCN1CCOC2C1CCc1ccc(cc21)C(N)=O
: