Target
D(2) dopamine receptor
Ligand
BDBM86474
Substrate
Ki
794.33±n/a nM
Comments
PDSP_3776
Citation
 Millan, MJCussac, DGobert, ALejeune, FRivet, JMMannoury La Cour, CNewman-Tancredi, APeglion, JL S32504, a novel naphtoxazine agonist at dopamine D3/D2 receptors: I. Cellular, electrophysiological, and neurochemical profile in comparison with ropinirole. J Pharmacol Exp Ther 309:903-20 (2004)  
Target
Name:
D(2) dopamine receptor
Synonyms:
D(2) dopamine receptor DOPAMINE D2 Long DRD2 Dopamine D2 receptor Dopamine D2 receptor (D2R) Dopamine2-like | d2
Type:
Cell-surface receptors
Mol. Mass.:
50647.10
Organism:
Homo sapiens (Human)
Description:
P14416
Residue:
443
  
Inhibitor
Name:
BDBM86474
Synonyms:
(+-)-trans-3,4,4a,5,6,10b-hexahydro-9-carbamoyl- 4-propyl-2H-naphth[1,2-b]-1,4-oxazine | S31411 (+-)
Type:
Small organic molecule
Emp. Form.:
C18H24N2O4
Mol. Mass.:
332.3942
SMILES:
CCCC1CC2=C(OCC=N2)C2(NC(=O)CC(O)=O)C=CCCC12
: