Target
Glutamate receptor ionotropic, kainate 2
Ligand
BDBM85741
Substrate
Ki
>10000±n/a nM
Comments
PDSP_3542
Citation
 Christensen, JKVarming, TAhring, PKJørgensen, TDNielsen, EA In vitro characterization of 5-carboxyl-2,4-di-benzamidobenzoic acid (NS3763), a noncompetitive antagonist of GLUK5 receptors. J Pharmacol Exp Ther 309:1003-10 (2004)  
Target
Name:
Glutamate receptor ionotropic, kainate 2
Synonyms:
EAA4 GLUR6 GRIK2_HUMAN GluR-6 Glutamate receptor 6 Glutamate receptor, ionotropic kainate 2 Glutamate-Kainate, GluR6
Type:
Enzyme Catalytic Domain
Mol. Mass.:
102592.78
Organism:
Homo sapiens (Human)
Description:
Q13002
Residue:
908
  
Inhibitor
Name:
BDBM85741
Synonyms:
ATPA NSC_2253
Type:
Small organic molecule
Emp. Form.:
C10H16N2O4
Mol. Mass.:
228.245
SMILES:
CC(C)(C)c1o[nH]c(=O)c1CC(N)C(O)=O
: