Target
Neuronal acetylcholine receptor subunit alpha-4
Ligand
BDBM50143313
Substrate
Ki
>10000±n/a nM
Comments
PDSP_3248
Citation
 Xiao, YKellar, KJ The comparative pharmacology and up-regulation of rat neuronal nicotinic receptor subtype binding sites stably expressed in transfected mammalian cells. J Pharmacol Exp Ther 310:98-107 (2004)  
Target
Name:
Neuronal acetylcholine receptor subunit alpha-4
Synonyms:
ACHA4_RAT Cholinergic, Nicotinic Alpha4Beta2 Chrna4 Neuronal acetylcholine receptor (alpha4beta2 nAChR) Neuronal acetylcholine receptor subunit alpha 4 beta 2 | Neuronal acetylcholine receptor subunit alpha-4
Type:
Enzyme
Mol. Mass.:
70196.44
Organism:
Rattus norvegicus (Rat)
Description:
P09483
Residue:
630
  
Inhibitor
Name:
BDBM50143313
Synonyms:
(12S,13aS)-12-Methoxy-1,4,5,6,9,11,12,13-octahydro-8H-pyrano[4',3':3,4]pyrido[2,1-i]indol-2-one DHbetaE
Type:
Small organic molecule
Emp. Form.:
C16H21NO3
Mol. Mass.:
275.3428
SMILES:
CO[C@H]1CC=C2CCN3CCC4=C(CC(=O)OC4)[C@]23C1
: