Target
P2X purinoceptor 2
Ligand
BDBM50000029
Substrate
Ki
854±n/a nM
Comments
PDSP_3349
Citation
 Jarvis, MFBianchi, BUchic, JTCartmell, JLee, CHWilliams, MFaltynek, C [3H]A-317491, a novel high-affinity non-nucleotide antagonist that specifically labels human P2X2/3 and P2X3 receptors. J Pharmacol Exp Ther 310:407-16 (2004)  
Target
Name:
P2X purinoceptor 2
Synonyms:
ATP receptor P2RX2_HUMAN Purinergic receptor | PurinergicP2X2/3
Type:
Enzyme Catalytic Domain
Mol. Mass.:
51765.18
Organism:
Homo sapiens (Human)
Description:
PurinergicP2X2/3 0 HUMAN::Q9UBL9
Residue:
471
  
Inhibitor
Name:
BDBM50000029
Synonyms:
4-Methyl-8-{4-methyl-3-[3-(3-{3-[2-methyl-5-(4,6,8-trisulfo-naphthalen-1-ylcarbamoyl)-phenylcarbamoyl]-phenyl}-ureido)-benzoylamino]-benzoylamino}-naphthalene-1,3,5-trisulfonic acid; hexa-kis Sodium salt CHEMBL265502 Suramin sodium suramin Na
Type:
Small organic molecule
Emp. Form.:
C51H34N6O23S6
Mol. Mass.:
1291.235
SMILES:
Cc1ccc(cc1NC(=O)c1cccc(NC(=O)Nc2cccc(c2)C(=O)Nc2cc(ccc2C)C(=O)Nc2ccc(c3cc(cc(c23)S([O-])(=O)=O)S([O-])(=O)=O)S([O-])(=O)=O)c1)C(=O)Nc1ccc(c2cc(cc(c12)S([O-])(=O)=O)S([O-])(=O)=O)S([O-])(=O)=O
: