Target
Beta-1 adrenergic receptor
Ligand
BDBM50171290
Substrate
Ki
1000±n/a nM
Comments
PDSP_3734
Citation
 Rinaldi-Carmona, MBarth, FCongy, CMartinez, SOustric, DPério, APoncelet, MMaruani, JArnone, MFinance, OSoubrié, PLe Fur, G SR147778 [5-(4-bromophenyl)-1-(2,4-dichlorophenyl)-4-ethyl-N-(1-piperidinyl)-1H-pyrazole-3-carboxamide], a new potent and selective antagonist of the CB1 cannabinoid receptor: biochemical and pharmacological characterization. J Pharmacol Exp Ther 310:905-14 (2004)  
Target
Name:
Beta-1 adrenergic receptor
Synonyms:
ADRB1 ADRB1_HUMAN Beta-1 adrenoceptor | adrenergic Beta1
Type:
G Protein-Coupled Receptor (GPCR)
Mol. Mass.:
51338.40
Organism:
Homo sapiens (Human)
Description:
P08588
Residue:
477
  
Inhibitor
Name:
BDBM50171290
Synonyms:
5-(4-Bromo-phenyl)-1-(2,4-dichloro-phenyl)-4-ethyl-1H-pyrazole-3-carboxylic acid piperidin-1-ylamide SR 147778
Type:
Small organic molecule
Emp. Form.:
C23H23BrCl2N4O
Mol. Mass.:
522.265
SMILES:
CCc1c(nn(c1-c1ccc(Br)cc1)-c1ccc(Cl)cc1Cl)C(=O)NN1CCCCC1
: