Target
Kappa-type opioid receptor
Ligand
BDBM86519
Substrate
Ki
2807±n/a nM
Comments
PDSP_3634
Citation
 Gilbert, AKHosztafi, SMahurter, LPasternak, GW Pharmacological characterization of dihydromorphine, 6-acetyldihydromorphine and dihydroheroin analgesia and their differentiation from morphine. Eur J Pharmacol 492:123-30 (2004)  
Target
Name:
Kappa-type opioid receptor
Synonyms:
Kappa Opioid Receptor OPRK1 Opiate Kappa 1 | mu/kappa opioid receptor
Type:
G Protein-Coupled Receptor (GPCR)
Mol. Mass.:
42744.99
Organism:
Cavia porcellus (domestic guinea pig)
Description:
P41144
Residue:
380
  
Inhibitor
Name:
BDBM86519
Synonyms:
CAS_11221 NSC_11221
Type:
Small organic molecule
Emp. Form.:
C21H25NO5
Mol. Mass.:
371.4269
SMILES:
CN1CCC23C4Oc5c2c(CC1C3CCC4OC(C)=O)ccc5OC(C)=O
: