Target
5-hydroxytryptamine receptor 2C
Ligand
BDBM84738
Substrate
Ki
1412.54±n/a nM
Comments
PDSP_647
Citation
 Knight, ARMisra, AQuirk, KBenwell, KRevell, DKennett, GBickerdike, M Pharmacological characterisation of the agonist radioligand binding site of 5-HT(2A), 5-HT(2B) and 5-HT(2C) receptors. Naunyn Schmiedebergs Arch Pharmacol 370:114-23 (2004)  
Target
Name:
5-hydroxytryptamine receptor 2C
Synonyms:
5-HT-2C 5-HT2C-INI 5-HTR2C 5-hydroxytryptamine receptor 2C (5-HT-2C) 5HT-1C HTR1C Serotonin (5-HT3) receptor Serotonin Receptor 2C
Type:
G Protein-Coupled Receptor (GPCR)
Mol. Mass.:
51836.79
Organism:
Homo sapiens (Human)
Description:
P28335
Residue:
458
  
Inhibitor
Name:
BDBM84738
Synonyms:
CAS_16105-77-4 Fenfluramine (+) NSC_3337 | d-Fenfluramine
Type:
Small organic molecule
Emp. Form.:
C12H16F3N
Mol. Mass.:
231.2573
SMILES:
CCNC(C)Cc1cccc(c1)C(F)(F)F
: