Target
Sodium-dependent serotonin transporter
Ligand
BDBM86532
Substrate
Ki
>10000±n/a nM
Comments
PDSP_4173
Citation
 Appendino, GDe Petrocellis, LTrevisani, MMinassi, ADaddario, NMoriello, ASGazzieri, DLigresti, ACampi, BFontana, GPinna, CGeppetti, PDi Marzo, V Development of the first ultra-potent "capsaicinoid" agonist at transient receptor potential vanilloid type 1 (TRPV1) channels and its therapeutic potential. J Pharmacol Exp Ther 312:561-70 (2005)  
Target
Name:
Sodium-dependent serotonin transporter
Synonyms:
5-HT Transporter 5HT transporter Anandamid membrane transporter, AMT Monoamine transporters; Norepinephrine & serotonin Slc6a4 Sodium-dependent serotonin transporter (SERT) | imipramine receptor
Type:
Multi-pass membrane protein
Mol. Mass.:
70168.43
Organism:
Rattus norvegicus (rat)
Description:
P31652
Residue:
630
  
Inhibitor
Name:
BDBM86532
Synonyms:
Rinvanil
Type:
Small organic molecule
Emp. Form.:
C26H43NO4
Mol. Mass.:
433.6239
SMILES:
CCCCCC[C@@H](O)CC=CCCCCCCCC(=O)NCc1ccc(O)c(OC)c1
: