Target
Neuronal acetylcholine receptor subunit alpha-4
Ligand
BDBM86241
Substrate
Ki
24.6±n/a nM
Comments
PDSP_666
Citation
 Grinevich, VPLetchworth, SRLindenberger, KAMenager, JMary, VSadieva, KABuhlman, LMBohme, GAPradier, LBenavides, JLukas, RJBencherif, M Heterologous expression of human {alpha}6{beta}4{beta}3{alpha}5 nicotinic acetylcholine receptors: binding properties consistent with their natural expression require quaternary subunit assembly including the {alpha}5 subunit. J Pharmacol Exp Ther 312:619-26 (2005)  
Target
Name:
Neuronal acetylcholine receptor subunit alpha-4
Synonyms:
ACHA4_RAT Cholinergic, Nicotinic Alpha4Beta2 Chrna4 Neuronal acetylcholine receptor (alpha4beta2 nAChR) Neuronal acetylcholine receptor subunit alpha 4 beta 2 | Neuronal acetylcholine receptor subunit alpha-4
Type:
Enzyme
Mol. Mass.:
70196.44
Organism:
Rattus norvegicus (Rat)
Description:
P09483
Residue:
630
  
Inhibitor
Name:
BDBM86241
Synonyms:
CAS_23255-54-1 NSC_31762
Type:
Small organic molecule
Emp. Form.:
C16H21NO3
Mol. Mass.:
275.3428
SMILES:
COC1CC=C2CCN3CCC4=C(CC(=O)OC4)C23C1
: