Target
D(1A) dopamine receptor
Ligand
BDBM50049047
Substrate
Ki
2.3±n/a nM
Comments
PDSP_664
Citation
 Salmi, PIsacson, RKull, B Dihydrexidine--the first full dopamine D1 receptor agonist. CNS Drug Rev 10:230-42 (2004)  
Target
Name:
D(1A) dopamine receptor
Synonyms:
DOPAMINE D1 Dopamine D1 high Dopamine receptor Dopamine1-like Drd1a
Type:
Enzyme Catalytic Domain
Mol. Mass.:
49429.75
Organism:
RAT
Description:
P18901
Residue:
446
  
Inhibitor
Name:
BDBM50049047
Synonyms:
5,6,6a,7,8,12b-Hexahydro-benzo[a]phenanthridine-10,11-diol Dihydrexidine | Dihydrexidine, DHX
Type:
Small organic molecule
Emp. Form.:
C17H17NO2
Mol. Mass.:
267.3224
SMILES:
Oc1cc2CCC3NCc4ccccc4C3c2cc1O
: