Target
D(2) dopamine receptor
Ligand
BDBM50049047
Substrate
Ki
43.2±n/a nM
Comments
PDSP_664
Citation
 Salmi, PIsacson, RKull, B Dihydrexidine--the first full dopamine D1 receptor agonist. CNS Drug Rev 10:230-42 (2004)  
Target
Name:
D(2) dopamine receptor
Synonyms:
DOPAMINE D2 DOPAMINE D2 Short Dopamine D2 receptor Drd2
Type:
G Protein-Coupled Receptor (GPCR)
Mol. Mass.:
50931.60
Organism:
Rattus norvegicus (rat)
Description:
P61169
Residue:
444
  
Inhibitor
Name:
BDBM50049047
Synonyms:
5,6,6a,7,8,12b-Hexahydro-benzo[a]phenanthridine-10,11-diol Dihydrexidine | Dihydrexidine, DHX
Type:
Small organic molecule
Emp. Form.:
C17H17NO2
Mol. Mass.:
267.3224
SMILES:
Oc1cc2CCC3NCc4ccccc4C3c2cc1O
: