Target
Aurora kinase A
Ligand
BDBM86625
Substrate
Meas. Tech.
In Vitro Kinase Assay
IC50
298±0.0 nM
Citation
 Kwiatkowski, NDeng, XWang, JTan, LVilla, FSantaguida, SHuang, HCMitchison, TMusacchio, AGray, N Selective aurora kinase inhibitors identified using a taxol-induced checkpoint sensitivity screen. ACS Chem Biol 7:185-96 (2012)  
Target
Name:
Aurora kinase A
Synonyms:
AIK ARK1 AURKA AYK1 Aurora kinase A (AURA) Aurora kinase A (Aurora A) Aurora-related kinase 1 BTAK Breast-tumor-amplified kinase STK15 Serine/threonine kinase 15 Serine/threonine-protein kinase aurora A hARK1
Type:
Serine/threonine-protein kinase
Mol. Mass.:
45830.98
Organism:
Homo sapiens (Human)
Description:
O14965
Residue:
403
  
Inhibitor
Name:
BDBM86625
Synonyms:
Benzo[e]pyrimido[5,4-b][1,4]diazepin-6(11H)-one, 31
Type:
Small organic molecule
Emp. Form.:
C27H29F4N7O
Mol. Mass.:
543.5591
SMILES:
CCN1CCN(Cc2ccc(Nc3ncc4N(C)C(=O)c5ccc(F)cc5N(C)c4n3)cc2C(F)(F)F)CC1
: