Target
Aurora kinase B
Ligand
BDBM86613
Substrate
Meas. Tech.
In Vitro Kinase Assay
IC50
43.7±0.0 nM
Citation
 Kwiatkowski, NDeng, XWang, JTan, LVilla, FSantaguida, SHuang, HCMitchison, TMusacchio, AGray, N Selective aurora kinase inhibitors identified using a taxol-induced checkpoint sensitivity screen. ACS Chem Biol 7:185-96 (2012)  
Target
Name:
Aurora kinase B
Synonyms:
AIK2 AIM1 ARK2 AURKB_HUMAN Aurora B-INCENP Aurora kinase B (AURKB) STK-1 STK12 Serine/threonine-protein kinase aurora B
Type:
Protein
Mol. Mass.:
39327.72
Organism:
Homo sapiens (Human)
Description:
Q96GD4
Residue:
344
  
Inhibitor
Name:
BDBM86613
Synonyms:
Benzo[e]pyrimido[5,4-b][1,4]diazepin-6(11H)-one, 19
Type:
Small organic molecule
Emp. Form.:
C26H25F3N6O3
Mol. Mass.:
526.5103
SMILES:
CN1c2ccccc2C(=O)N(C)c2cnc(Nc3ccc(C(=O)N4CCC(O)CC4)c(c3)C(F)(F)F)nc12
: