Target
Aurora kinase B
Ligand
BDBM86618
Substrate
Meas. Tech.
In Vitro Kinase Assay
IC50
782±0.0 nM
Citation
 Kwiatkowski, NDeng, XWang, JTan, LVilla, FSantaguida, SHuang, HCMitchison, TMusacchio, AGray, N Selective aurora kinase inhibitors identified using a taxol-induced checkpoint sensitivity screen. ACS Chem Biol 7:185-96 (2012)  
Target
Name:
Aurora kinase B
Synonyms:
AIK2 AIM1 ARK2 AURKB_HUMAN Aurora B-INCENP Aurora kinase B (AURKB) STK-1 STK12 Serine/threonine-protein kinase aurora B
Type:
Protein
Mol. Mass.:
39327.72
Organism:
Homo sapiens (Human)
Description:
Q96GD4
Residue:
344
  
Inhibitor
Name:
BDBM86618
Synonyms:
Benzo[e]pyrimido[5,4-b][1,4]diazepin-6(11H)-one, 24
Type:
Small organic molecule
Emp. Form.:
C29H34F3N7O
Mol. Mass.:
553.6218
SMILES:
CCN1CCN(Cc2ccc(Nc3ncc4N(C)C(=O)c5ccccc5N(C(C)C)c4n3)cc2C(F)(F)F)CC1
: