Target
Histamine receptor H3
Ligand
BDBM50139391
Substrate
Ki
3.89±n/a nM
Comments
PDSP_4079
Citation
 Esbenshade, TAFox, GBKrueger, KMMiller, TRKang, CHDenny, LIWitte, DGYao, BBPan, LWetter, JMarsh, KBennani, YLCowart, MDSullivan, JPHancock, AA Pharmacological properties of ABT-239 [4-(2-{2-[(2R)-2-Methylpyrrolidinyl]ethyl}-benzofuran-5-yl)benzonitrile]: I. Potent and selective histamine H3 receptor antagonist with drug-like properties. J Pharmacol Exp Ther 313:165-75 (2005)  
Target
Name:
Histamine receptor H3
Synonyms:
HISTAMINE H3 | HRH3
Type:
Enzyme Catalytic Domain
Mol. Mass.:
16901.59
Organism:
Dog
Description:
Q865E3
Residue:
147
  
Inhibitor
Name:
BDBM50139391
Synonyms:
(R)-4-(2-(2-(2-methylpyrrolidin-1-yl)ethyl)benzofuran-5-yl)benzonitrile ABT-239 | CHEMBL351231
Type:
Small organic molecule
Emp. Form.:
C22H22N2O
Mol. Mass.:
330.4229
SMILES:
C[C@@H]1CCCN1CCc1cc2cc(ccc2o1)-c1ccc(cc1)C#N
: