Target
Polyunsaturated fatty acid 5-lipoxygenase
Ligand
BDBM86691
Substrate
Ki
>10000±n/a nM
Comments
PDSP_4864
Citation
 Mimura, HIkemura, TKotera, OSawada, MTashiro, SFuse, EUeno, KManabe, HOhshima, EKarasawa, AMiyaji, H Inhibitory effect of the 4-aminotetrahydroquinoline derivatives, selective chemoattractant receptor-homologous molecule expressed on T helper 2 cell antagonists, on eosinophil migration induced by prostaglandin D2. J Pharmacol Exp Ther 314:244-51 (2005)  
Target
Name:
Polyunsaturated fatty acid 5-lipoxygenase
Synonyms:
5-LO 5-Lipoxygenase (5-LO) 5-Lipoygenase ALOX5 LOG5 | LOX5_HUMAN
Type:
Enzyme
Mol. Mass.:
77972.74
Organism:
Homo sapiens (Human)
Description:
Recombinant protein was purified from E. coli lysate. After ammonium sulfate precipitation and subsequent steps, the supernatant (S100) was used for 5-LO activity assay.
Residue:
674
  
Inhibitor
Name:
BDBM86691
Synonyms:
K604
Type:
Small organic molecule
Emp. Form.:
C27H26N2O2
Mol. Mass.:
410.5075
SMILES:
CC1CC(N(C(=O)C2CC2)c2ccccc2)c2ccccc2N1C(=O)c1ccccc1
: