Target
Prostaglandin G/H synthase 1
Ligand
BDBM86691
Substrate
Ki
>10000±n/a nM
Comments
PDSP_4864
Citation
 Mimura, HIkemura, TKotera, OSawada, MTashiro, SFuse, EUeno, KManabe, HOhshima, EKarasawa, AMiyaji, H Inhibitory effect of the 4-aminotetrahydroquinoline derivatives, selective chemoattractant receptor-homologous molecule expressed on T helper 2 cell antagonists, on eosinophil migration induced by prostaglandin D2. J Pharmacol Exp Ther 314:244-51 (2005)  
Target
Name:
Prostaglandin G/H synthase 1
Synonyms:
COX-1 Cyclooxygenase Cyclooxygenase-1 (COX-1) PTGS1 | Prostaglandin G/H synthase (cyclooxygenase)
Type:
Enzyme
Mol. Mass.:
68692.62
Organism:
Homo sapiens (Human)
Description:
P23219
Residue:
599
  
Inhibitor
Name:
BDBM86691
Synonyms:
K604
Type:
Small organic molecule
Emp. Form.:
C27H26N2O2
Mol. Mass.:
410.5075
SMILES:
CC1CC(N(C(=O)C2CC2)c2ccccc2)c2ccccc2N1C(=O)c1ccccc1
: