Target
Histamine H2 receptor
Ligand
BDBM86692
Substrate
Ki
>10000±n/a nM
Comments
PDSP_4863
Citation
 Mimura, HIkemura, TKotera, OSawada, MTashiro, SFuse, EUeno, KManabe, HOhshima, EKarasawa, AMiyaji, H Inhibitory effect of the 4-aminotetrahydroquinoline derivatives, selective chemoattractant receptor-homologous molecule expressed on T helper 2 cell antagonists, on eosinophil migration induced by prostaglandin D2. J Pharmacol Exp Ther 314:244-51 (2005)  
Target
Name:
Histamine H2 receptor
Synonyms:
Gastric receptor I HISTAMINE H2 HRH2_HUMAN Histamine H2-Gs alpha S
Type:
G Protein-Coupled Receptor (GPCR)
Mol. Mass.:
40115.31
Organism:
Homo sapiens (Human)
Description:
Residue:
359
  
Inhibitor
Name:
BDBM86692
Synonyms:
K117
Type:
Small organic molecule
Emp. Form.:
C27H28N2O2
Mol. Mass.:
412.5234
SMILES:
CC(C)C(=O)N(C1CC(C)N(C(=O)c2ccccc2)c2ccccc12)c1ccccc1
: