Target
Prostaglandin D2 receptor
Ligand
BDBM86692
Substrate
Ki
>10000±n/a nM
Comments
PDSP_4863
Citation
 Mimura, HIkemura, TKotera, OSawada, MTashiro, SFuse, EUeno, KManabe, HOhshima, EKarasawa, AMiyaji, H Inhibitory effect of the 4-aminotetrahydroquinoline derivatives, selective chemoattractant receptor-homologous molecule expressed on T helper 2 cell antagonists, on eosinophil migration induced by prostaglandin D2. J Pharmacol Exp Ther 314:244-51 (2005)  
Target
Name:
Prostaglandin D2 receptor
Synonyms:
PD2R_HUMAN Prostaglandin D2 Prostanoid DP receptor
Type:
Enzyme
Mol. Mass.:
40288.87
Organism:
Homo sapiens (Human)
Description:
Q13258
Residue:
359
  
Inhibitor
Name:
BDBM86692
Synonyms:
K117
Type:
Small organic molecule
Emp. Form.:
C27H28N2O2
Mol. Mass.:
412.5234
SMILES:
CC(C)C(=O)N(C1CC(C)N(C(=O)c2ccccc2)c2ccccc12)c1ccccc1
: