Target
Bile salt export pump
Ligand
BDBM86707
Substrate
Ki
>10000±n/a nM
Comments
PDSP_5735
Citation
 Hirano, MMaeda, KHayashi, HKusuhara, HSugiyama, Y Bile salt export pump (BSEP/ABCB11) can transport a nonbile acid substrate, pravastatin. J Pharmacol Exp Ther 314:876-82 (2005)  
Target
Name:
Bile salt export pump
Synonyms:
ABCBB_RAT Abcb11 Bile salt export pump Sister of P-glycoprotein | Spgp
Type:
PROTEIN
Mol. Mass.:
146267.86
Organism:
Rattus norvegicus
Description:
ChEMBL_1481883
Residue:
1321
  
Inhibitor
Name:
BDBM86707
Synonyms:
CAS_147511-69-1 | Pitavastatin
Type:
Small organic molecule
Emp. Form.:
C25H24FNO4
Mol. Mass.:
421.4608
SMILES:
O[C@H](C[C@H](O)\C=C\c1c(nc2ccccc2c1-c1ccc(F)cc1)C1CC1)CC(O)=O
: