Target
Bile salt export pump
Ligand
BDBM86706
Substrate
Ki
>10000±n/a nM
Comments
PDSP_5741
Citation
 Hirano, MMaeda, KHayashi, HKusuhara, HSugiyama, Y Bile salt export pump (BSEP/ABCB11) can transport a nonbile acid substrate, pravastatin. J Pharmacol Exp Ther 314:876-82 (2005)  
Target
Name:
Bile salt export pump
Synonyms:
ABCBB_RAT Abcb11 Bile salt export pump Sister of P-glycoprotein | Spgp
Type:
PROTEIN
Mol. Mass.:
146267.86
Organism:
Rattus norvegicus
Description:
ChEMBL_1481883
Residue:
1321
  
Inhibitor
Name:
BDBM86706
Synonyms:
Pravastatin lactone
Type:
Small organic molecule
Emp. Form.:
C23H34O6
Mol. Mass.:
406.5125
SMILES:
CC[C@H](C)C(=O)O[C@H]1C[C@H](O)C=C2C=C[C@H](C)[C@H](CC[C@@H]3C[C@@H](O)CC(=O)O3)[C@@H]12
: