Target
Alpha-1A adrenergic receptor
Ligand
BDBM85833
Substrate
Ki
81.28±n/a nM
Comments
PDSP_2446
Citation
 Corradetti, RMlinar, BFalsini, CPugliese, AMCilia, ADestefani, CTesta, R Differential effects of the 5-hydroxytryptamine (5-HT)1A receptor inverse agonists Rec 27/0224 and Rec 27/0074 on electrophysiological responses to 5-HT1A receptor activation in rat dorsal raphe nucleus and hippocampus in vitro. J Pharmacol Exp Ther 315:109-17 (2005)  
Target
Name:
Alpha-1A adrenergic receptor
Synonyms:
ADA1A_HUMAN ADRA1C Alpha 1A-adrenoceptor Alpha adrenergic receptor 1a Alpha-adrenergic receptor 1c adrenergic Alpha1 | adrenergic Alpha1C
Type:
Cell-surface receptors
Mol. Mass.:
51511.67
Organism:
Homo sapiens (Human)
Description:
P35348
Residue:
466
  
Inhibitor
Name:
BDBM85833
Synonyms:
N-[2-[4-(2-methoxyphenyl)-1-piperazinyl]- ethyl]-N-(2-nitrophenyl)cyclohexanecarboxamide | Rec 15/3079
Type:
Small organic molecule
Emp. Form.:
C26H34N4O4
Mol. Mass.:
466.5726
SMILES:
COc1ccccc1N1CCN(CCN(C(=O)C2CCCCC2)c2ccccc2[N+]([O-])=O)CC1
: